Problèmes et questions sur les environnements graphiques et les applications.
Répondre

Erreur compilation lors mise à jour

#1Messageil y a 5 mois

Bonsoir,

Depuis AUR, j'ai une mise à jour qui me renvoie ceci : /usr/sbin/gcc failed with status: 1

Pouvez-vous m'en dire plus sur cette erreur ?

Voici le retour "complet" du terminal :

==> Lancer la compilation de tilix ? [O/n]
==> --------------------------------------
==> 

==> Construction et installation du paquet
==> Création du paquet tilix 1.7.1-1 (dim oct 29 20:15:13 CET 2017)
==> Vérification des dépendances pour l’exécution...
==> Vérification des dépendances pour la compilation...
==> Récupération des sources...
  -> tilix-1.7.1.tar.gz trouvé
==> Validation des fichiers source avec sha256sums...
    tilix-1.7.1.tar.gz ... Réussite
==> Extraction des sources...
  -> Extraction de tilix-1.7.1.tar.gz avec bsdtar
==> Lancement de prepare()...
==> Suppression du répertoire $pkgdir/ existant...
==> Lancement de build()...
checking for a BSD-compatible install... /bin/install -c
checking for ldmd... /usr/sbin/ldmd
checking for glib-compile-resources... /usr/sbin/glib-compile-resources
checking for pkg-config... /usr/sbin/pkg-config
checking pkg-config is at least version 0.9.0... yes
checking whether make sets $(MAKE)... yes
checking for a thread-safe mkdir -p... /usr/sbin/mkdir -p
checking for a sed that does not truncate output... /usr/sbin/sed
checking whether NLS is requested... yes
checking for msgfmt... /usr/sbin/msgfmt
checking for gmsgfmt... /usr/sbin/msgfmt
checking for xgettext... /usr/sbin/xgettext
checking for msgmerge... /usr/sbin/msgmerge
checking for gcc... gcc
checking whether the C compiler works... yes
checking for C compiler default output file name... a.out
checking for suffix of executables... 
checking whether we are cross compiling... no
checking for suffix of object files... o
checking whether we are using the GNU C compiler... yes
checking whether gcc accepts -g... yes
checking for gcc option to accept ISO C89... none needed
checking whether gcc understands -c and -o together... yes
checking build system type... x86_64-pc-linux-gnu
checking host system type... x86_64-pc-linux-gnu
checking for ld used by gcc... /usr/sbin/ld
checking if the linker (/usr/sbin/ld) is GNU ld... yes
checking for shared library run path origin... done
checking how to run the C preprocessor... gcc -E
checking for grep that handles long lines and -e... /usr/sbin/grep
checking for egrep... /usr/sbin/grep -E
checking for CFPreferencesCopyAppValue... no
checking for CFLocaleCopyCurrent... no
checking for GNU gettext in libc... yes
checking whether to use NLS... yes
checking where the gettext function comes from... libc
checking for po4a-translate... /usr/bin/vendor_perl/po4a-translate
checking for gtkd-3 >= 3.5.0 vted-3 >= 3.5.0... yes
checking for x11... yes
checking whether build environment is sane... yes
checking for gawk... gawk
checking for style of include used by make... GNU
checking whether make supports nested variables... yes
checking dependency style of gcc... none
checking that generated files are newer than configure... done
configure: creating ./config.status
config.status: creating Makefile
config.status: creating data/appdata/Makefile
config.status: creating data/icons/Makefile
config.status: creating data/pkg/desktop/Makefile
config.status: creating data/resources/Makefile
config.status: creating data/man/Makefile
config.status: creating po/Makefile.in
config.status: executing po-directories commands
config.status: creating po/POTFILES
config.status: creating po/Makefile
config.status: executing depfiles commands
Making all in data/appdata
make[1] : on entre dans le répertoire « /tmp/yaourt-tmp-bruno/aur-tilix/src/tilix-1.7.1/data/appdata »
make[1]: rien à faire pour « all ».
make[1] : on quitte le répertoire « /tmp/yaourt-tmp-bruno/aur-tilix/src/tilix-1.7.1/data/appdata »
Making all in data/icons
make[1] : on entre dans le répertoire « /tmp/yaourt-tmp-bruno/aur-tilix/src/tilix-1.7.1/data/icons »
make[1]: rien à faire pour « all ».
make[1] : on quitte le répertoire « /tmp/yaourt-tmp-bruno/aur-tilix/src/tilix-1.7.1/data/icons »
Making all in data/pkg/desktop
make[1] : on entre dans le répertoire « /tmp/yaourt-tmp-bruno/aur-tilix/src/tilix-1.7.1/data/pkg/desktop »
make[1]: rien à faire pour « all ».
make[1] : on quitte le répertoire « /tmp/yaourt-tmp-bruno/aur-tilix/src/tilix-1.7.1/data/pkg/desktop »
Making all in data/resources
make[1] : on entre dans le répertoire « /tmp/yaourt-tmp-bruno/aur-tilix/src/tilix-1.7.1/data/resources »
/usr/sbin/glib-compile-resources --sourcedir=. --target=tilix.gresource tilix.gresource.xml
make[1] : on quitte le répertoire « /tmp/yaourt-tmp-bruno/aur-tilix/src/tilix-1.7.1/data/resources »
Making all in data/man
make[1] : on entre dans le répertoire « /tmp/yaourt-tmp-bruno/aur-tilix/src/tilix-1.7.1/data/man »
make[1]: rien à faire pour « all ».
make[1] : on quitte le répertoire « /tmp/yaourt-tmp-bruno/aur-tilix/src/tilix-1.7.1/data/man »
Making all in po
make[1] : on entre dans le répertoire « /tmp/yaourt-tmp-bruno/aur-tilix/src/tilix-1.7.1/po »
make[1]: rien à faire pour « all ».
make[1] : on quitte le répertoire « /tmp/yaourt-tmp-bruno/aur-tilix/src/tilix-1.7.1/po »
make[1] : on entre dans le répertoire « /tmp/yaourt-tmp-bruno/aur-tilix/src/tilix-1.7.1 »
ldmd -L-lvted-3 -L-L/usr/lib// -L-lgtkd-3 -L-ldl -L-lX11 tilix.o -oftilix
/usr/lib/libgtkd-3.so : référence indéfinie vers « _D4core6thread6Thread6__ctorMFDFZvmZC4core6thread6Thread »
/usr/lib/libgtkd-3.so : référence indéfinie vers « _D3std4conv13ConvException6__ctorMFNaNbNfAyaAyamZC3std4conv13ConvException »
collect2: error: ld a retourné le statut de sortie 1
Error: /usr/sbin/gcc failed with status: 1
make[1]: *** [Makefile:1037: tilix] Error 1
make[1] : on quitte le répertoire « /tmp/yaourt-tmp-bruno/aur-tilix/src/tilix-1.7.1 »
make: *** [Makefile:606: all-recursive] Error 1
Merci.

Erreur compilation lors mise à jour

#2Messageil y a 5 mois

Cela signifie que gcc n'a pas réussi à compiler le code. Il doit te manquer quelques librairies, c'est du moins ainsi que j'interprète les lignes qui renvoient des erreurs.

@+

Erreur compilation lors mise à jour

#3Messageil y a 5 mois

Salut :salut:
Si on lance l'installation de tilix dans un terminal avec yaourt on peut voir ces commentaires
jeyhunn660 commented on 2017-10-14 17:23
Hi @dsboger, I can't install tilix using gtkd, I get following errors:

ldmd -L-lvted-3 -L-L/usr/lib// -L-lgtkd-3 -L-ldl -L-lX11 tilix.o -oftilix
/usr/lib/libgtkd-3.so: undefined reference to `_D4core6thread6Thread6__ctorMFDFZvmZC4core6thread6Thread'
/usr/lib/libgtkd-3.so: undefined reference to `_D3std4conv13ConvException6__ctorMFNaNbNfAyaAyamZC3std4conv13ConvException'
collect2: error: ld returned 1 exit status
Error: /usr/bin/gcc failed with status: 1

dsboger commented on 2017-10-14 21:24
@jeyhunn660 have you tried rebuilding GtkD? It seems to be the same error reported a few comments below.

jeyhunn660 commented on 2017-10-14 21:41
@dsboger , thank you so much. I rebuilt gtkd and then installed tilix successfully..
Donc d’après ces commentaires et un célèbre traducteur en ligne il faut refaire la compilation de GtkD, c'est lui qui semblerai posé des problèmes.


Edit:

J'ai essayé la compilation de tilix et ça à fonctionné chez moi,
je n'avais pas GtkD d'installé avant ça a donc du compiler et installé la bonne version.

Erreur compilation lors mise à jour

#4Messageil y a 5 mois

:salut: Sinon il y a aussi tilix-bin qui vous évitera de passer trois plombes à compiler :siffle Je dis ça, je ne dis rien hein ? :wink:

Erreur compilation lors mise à jour

#5Messageil y a 5 mois

:salut:
je confirme les écrits de Fred6681, j'avais eu cette erreur. Il faut juste réinstaller gtkd avant tilix comme marqué dans les commentaires.

Erreur compilation lors mise à jour

#6Messageil y a 5 mois

Eh ben non, c'est encore une erreur de gpg...
AUR commence à m'énerver avec leurs authetifications à tout vent.
Comme si le créateur et/ou le mainteneur des paquets allait s'amuser à "torpiller" sa création. Je veux bien qu'il y ait un minimum de sécurité, mais trop, c'est de la parano. :colère::colère:

Erreur compilation lors mise à jour

#7Messageil y a 5 mois

:maisnon: je ré-affirme mes dires, ton erreur (premier post) était un problème de compilation !
Lorsque l'on a un problème de clé, la compilation n'est même lancée.

les clés gpg ont toujours existées en nombre dans aur, aur est à l'origine (et officiellement) pour les utilisateurs archlinux qui sont sensés connaitre cette "problématique". C'est un peu comme des nouveaux utilisateurs qui cherchent à supprimer le password pour pacman/yaourt, la sécurité ne simplifie jamais l'utilisation mais les contraintes quelle entraîne ne sont la que pour notre bien.
Je dirais même qu'avoir juste un minimum de sécurité est une très mauvaise chose : elle fait croire à l'utilisateur qu'il est protégé alors qu'il n'en est rien.

Erreur compilation lors mise à jour

#8Messageil y a 5 mois

papajoke a écrit :
il y a 5 mois
:maisnon: je ré-affirme mes dires, ton erreur (premier post) était un problème de compilation !
Lorsque l'on a un problème de clé, la compilation n'est même lancée.

les clés gpg ont toujours existées en nombre dans aur, aur est à l'origine (et officiellement) pour les utilisateurs archlinux qui sont sensés connaitre cette "problématique". C'est un peu comme des nouveaux utilisateurs qui cherchent à supprimer le password pour pacman/yaourt, la sécurité ne simplifie jamais l'utilisation mais les contraintes quelle entraîne ne sont la que pour notre bien.
Je dirais même qu'avoir juste un minimum de sécurité est une très mauvaise chose : elle fait croire à l'utilisateur qu'il est protégé alors qu'il n'en est rien.
Mwais, mais j'ai quand même dans l'idée que Arch devient de plus en plus "trumpiste", je m'explique : j'ai le sentiment qu'ils veulent de plus en plus limiter leurs dépôts aux Archlinuxiens et non plus à nous pôvres disciples de Manjaro.
Je suis quand même parvenu à le compiler, mais en prenant tilix-bin. Tilix seul : rien à faire.

Je mets donc en résolu.
Merci papajoke.

Répondre